said in Community Project | Cardinal Menu System Instructions, Help, and Discussion:

Can somebody please help to get this working. I have all the plugins extracted to the correct directory, I have generated the VS project files using VS community 2015 which is installed using the custom menu and making sure VS C++ is ticked but when i goto open it asks me first to install missing modules (which i'm aware is fine) then i get a messag saying "cardinalmenu could not be compiled. Try Rebuilding from source manually" please can somebody help me, i took the day off work to try and get this up and running but i can get over the first hurdle. lol

I've also tried using VS 2017 now and still have the same problem.

Heres the error log from VS if it helps:

1>------ Rebuild All started: Project: CardinalMenu, Configuration: Development_Editor x64 ------
1>Cleaning CardinalMenuEditor Binaries...
1>Creating makefile for CardinalMenuEditor (no existing makefile)
1>Performing full C++ include scan (no include cache file)
1>Using Visual Studio 2017 14.16.27023 toolchain (C:\Program Files (x86)\Microsoft Visual Studio\2017\Community\VC\Tools\MSVC\14.16.27023) and Windows 10.0.17763.0 SDK (C:\Program Files (x86)\Windows Kits\10).
1>UnrealBuildTool : error : Expecting to find a type to be declared in a module rules named 'NvCloth' in UE4Rules, Version=0.0.0.0, Culture=neutral, PublicKeyToken=null. This type must derive from the 'ModuleRules' type defined by Unreal Build Tool.
1> (see ../Programs/UnrealBuildTool/Log.txt for full exception trace)
1>C:\Program Files (x86)\Microsoft Visual Studio\2017\Community\Common7\IDE\VC\VCTargets\Microsoft.MakeFile.Targets(49,5): error MSB3073: The command "D:\Games\UE4\UE_4.21\Engine\Build\BatchFiles\Rebuild.bat CardinalMenuEditor Win64 Development "C:\Users\Bone\Desktop\CardinalMenu_Project_v181120_421\CardinalMenu_Project_v181120_421\CardinalMenu.uproject" -WaitMutex -FromMsBuild" exited with code -1.
1>Done building project "CardinalMenu.vcxproj" -- FAILED.
========== Rebuild All: 0 succeeded, 1 failed, 0 skipped ==========

I'm assuming you're the one who had problems with this and posted in the forums? If so, I'm glad you were able to figure it out by trying a different machine.